Target
Beta-2 adrenergic receptor
Ligand
BDBM50242856
Substrate
Meas. Tech.
ChEMBL_1746041 (CHEMBL4180551)
EC50
4500±n/a nM
Citation
 Kato, EKimura, SKawabata, J Ability of higenamine and related compounds to enhance glucose uptake in L6 cells. Bioorg Med Chem 25:6412-6416 (2017)  
Target
Name:
Beta-2 adrenergic receptor
Synonyms:
ADRB2_RAT Adrb2r | Adrenergic receptor beta
Type:
PROTEIN
Mol. Mass.:
46896.26
Organism:
Rattus norvegicus
Description:
ChEMBL_38603
Residue:
418
  
Inhibitor
Name:
BDBM50242856
Synonyms:
(1R)-1-(4-hydroxybenzyl)-1,2,3,4-tetrahydroisoquinoline-6,7-diol CHEMBL501778
Type:
Small organic molecule
Emp. Form.:
C16H17NO3
Mol. Mass.:
271.3111
SMILES:
Oc1ccc(C[C@H]2NCCc3cc(O)c(O)cc23)cc1
: