Target
Voltage-dependent T-type calcium channel subunit alpha-1G
Ligand
BDBM50452242
Substrate
Meas. Tech.
ChEMBL_1747209 (CHEMBL4181719)
IC50
1.000000±n/a nM
Citation
 Bezençon, OHeidmann, BSiegrist, RStamm, SRichard, SPozzi, DCorminboeuf, ORoch, CKessler, MErtel, EAReymond, IPfeifer, Tde Kanter, RToeroek-Schafroth, MMoccia, LGMawet, JMoon, RRey, MCapeleto, BFournier, E Discovery of a Potent, Selective T-type Calcium Channel Blocker as a Drug Candidate for the Treatment of Generalized Epilepsies. J Med Chem 60:9769-9789 (2017)  
Target
Name:
Voltage-dependent T-type calcium channel subunit alpha-1G
Synonyms:
CAC1G_HUMAN KIAA1123 Voltage-gated T-type calcium channel alpha-1G subunit
Type:
PROTEIN
Mol. Mass.:
262471.14
Organism:
Homo sapiens (Human)
Description:
ChEMBL_1515216
Residue:
2377
  
Inhibitor
Name:
BDBM50452242
Synonyms:
CHEMBL4206509
Type:
Small organic molecule
Emp. Form.:
C22H19F4N3O
Mol. Mass.:
417.3994
SMILES:
Fc1ccc(Cn2ccc(NC(=O)Cc3ccc(cc3)C3CC(F)(F)C3)n2)cc1F
: