Target
Voltage-dependent T-type calcium channel subunit alpha-1I
Ligand
BDBM50452243
Substrate
Meas. Tech.
ChEMBL_1747211 (CHEMBL4181721)
IC50
0.890000±n/a nM
Citation
 Bezençon, OHeidmann, BSiegrist, RStamm, SRichard, SPozzi, DCorminboeuf, ORoch, CKessler, MErtel, EAReymond, IPfeifer, Tde Kanter, RToeroek-Schafroth, MMoccia, LGMawet, JMoon, RRey, MCapeleto, BFournier, E Discovery of a Potent, Selective T-type Calcium Channel Blocker as a Drug Candidate for the Treatment of Generalized Epilepsies. J Med Chem 60:9769-9789 (2017)  
Target
Name:
Voltage-dependent T-type calcium channel subunit alpha-1I
Synonyms:
CAC1I_HUMAN KIAA1120 Voltage-gated T-type calcium channel alpha-1I subunit
Type:
PROTEIN
Mol. Mass.:
245101.25
Organism:
Homo sapiens (Human)
Description:
ChEMBL_538845
Residue:
2223
  
Inhibitor
Name:
BDBM50452243
Synonyms:
CHEMBL4205005
Type:
Small organic molecule
Emp. Form.:
C20H20F2N4O
Mol. Mass.:
370.3958
SMILES:
CN(C)c1ccc(CC(=O)Nc2ccn(Cc3ccc(F)c(F)c3)n2)cc1
: