Target
Muscarinic acetylcholine receptor M1
Ligand
BDBM50452412
Substrate
Meas. Tech.
ChEMBL_1747515 (CHEMBL4182025)
EC50
>10000±n/a nM
Citation
 Flohr, AHutter, RMueller, BBohnert, CPellisson, MSchaffhauser, H Discovery of the first low-shift positive allosteric modulators for the muscarinic M1 receptor. Bioorg Med Chem Lett 27:5415-5419 (2017)  
Target
Name:
Muscarinic acetylcholine receptor M1
Synonyms:
ACM1_HUMAN Cholinergic receptor, muscarinic 1 | Cholinergic, muscarinic M1
Type:
Protein
Mol. Mass.:
51442.54
Organism:
Homo sapiens (Human)
Description:
P11229
Residue:
460
  
Inhibitor
Name:
BDBM50452412
Synonyms:
CHEMBL4208883
Type:
Small organic molecule
Emp. Form.:
C18H16N2OS
Mol. Mass.:
308.397
SMILES:
CC1N=C(c2ccccc2)c2cc(ccc2NC1=S)C(C)=O
: