Target
Gamma-aminobutyric acid receptor subunit alpha-2/beta-3/gamma-2
Ligand
BDBM50452383
Substrate
Meas. Tech.
ChEMBL_1747530 (CHEMBL4182040)
EC50
>24000±n/a nM
Citation
 Flohr, AHutter, RMueller, BBohnert, CPellisson, MSchaffhauser, H Discovery of the first low-shift positive allosteric modulators for the muscarinic M1 receptor. Bioorg Med Chem Lett 27:5415-5419 (2017)  
Target
Name:
Gamma-aminobutyric acid receptor subunit alpha-2/beta-3/gamma-2
Synonyms:
Type:
Mol. Mass.:
Description:
ASSAY_ID of ChEMBL is 1747530
Components:
This complex has 3 components.
Component 1
Name:
Gamma-aminobutyric acid receptor subunit gamma-2
Synonyms:
GBRG2_RAT Gamma-aminobutyric acid receptor subunit gamma-2 (GABA(A) gamma-2)
Type:
Enzyme
Mol. Mass.:
54087.63
Organism:
Rattus norvegicus (Rat)
Description:
P18508
Residue:
466
  
Component 2
Name:
Gamma-aminobutyric acid receptor subunit alpha-2
Synonyms:
GABA A Alpha2Beta2Gamma2 GABA A receptor alpha-2/beta-2/gamma-2 GABA(A) receptor subunit alpha-2 Gabra-2 Gamma-aminobutyric acid receptor subunit alpha-2
Type:
Enzyme
Mol. Mass.:
51195.57
Organism:
Rattus norvegicus (Rat)
Description:
P23576
Residue:
451
  
Component 3
Name:
Gamma-aminobutyric acid receptor subunit beta-3
Synonyms:
GABA receptor beta-3 subunit Gabrb-3 | Gabrb3
Type:
PROTEIN
Mol. Mass.:
54180.66
Organism:
Rattus norvegicus
Description:
EBI_12481
Residue:
473
  
Inhibitor
Name:
BDBM50452383
Synonyms:
CHEMBL4218339
Type:
Small organic molecule
Emp. Form.:
C18H17ClN2S
Mol. Mass.:
328.859
SMILES:
CC(C)[C@@H]1N=C(c2ccccc2)c2cc(Cl)ccc2NC1=S
: