Target
Nuclear receptor ROR-alpha
Ligand
BDBM50452782
Substrate
Meas. Tech.
ChEMBL_1748338 (CHEMBL4182848)
EC50
>2000±n/a nM
Citation
 Gong, HWeinstein, DSLu, ZDuan, JJStachura, SHaque, LKarmakar, AHemagiri, HRaut, DKGupta, AKKhan, JCamac, DSack, JSPudzianowski, AWu, DRYarde, MShen, DRBorowski, VXie, JHSun, HD'Arienzo, CDabros, MGalella, MAWang, FWeigelt, CAZhao, QFoster, WSomerville, JESalter-Cid, LMBarrish, JCCarter, PHDhar, TGM Identification of bicyclic hexafluoroisopropyl alcohol sulfonamides as retinoic acid receptor-related orphan receptor gamma (ROR?/RORc) inverse agonists. Employing structure-based drug design to improve pregnane X receptor (PXR) selectivity. Bioorg Med Chem Lett 28:85-93 (2018)  
Target
Name:
Nuclear receptor ROR-alpha
Synonyms:
NR1F1 Nuclear receptor subfamily 1 group F member 1 RORA RZRA | Retinoid-related orphan receptor-alpha
Type:
PROTEIN
Mol. Mass.:
58976.26
Organism:
Homo sapiens (Human)
Description:
ChEMBL_101591
Residue:
523
  
Inhibitor
Name:
BDBM50452782
Synonyms:
CHEMBL4210791
Type:
Small organic molecule
Emp. Form.:
C17H12F7NO3S2
Mol. Mass.:
475.401
SMILES:
OC(c1ccc2N(CCSc2c1)S(=O)(=O)c1ccc(F)cc1)(C(F)(F)F)C(F)(F)F
: