Target
Nonstructural protein 5A
Ligand
BDBM50453100
Substrate
Meas. Tech.
ChEMBL_1749040 (CHEMBL4183550)
EC50
0.001800±n/a nM
Citation
 Wagner, RRandolph, JTPatel, SVNelson, LMatulenko, MAKeddy, RPratt, JKLiu, DKrueger, ACDonner, PLHutchinson, DKFlentge, CBetebenner, DRockway, TMaring, CJNg, TIKrishnan, PPilot-Matias, TCollins, CPanchal, NReisch, TDekhtyar, TMondal, RStolarik, DFGao, YGao, WBeno, DAKati, WM Highlights of the Structure-Activity Relationships of Benzimidazole Linked Pyrrolidines Leading to the Discovery of the Hepatitis C Virus NS5A Inhibitor Pibrentasvir (ABT-530). J Med Chem 61:4052-4066 (2018)  
Target
Name:
Nonstructural protein 5A
Synonyms:
NS5A | Nonstructural protein 5A
Type:
PROTEIN
Mol. Mass.:
48587.20
Organism:
Hepatitis C virus
Description:
ChEMBL_108438
Residue:
447
  
Inhibitor
Name:
BDBM50453100
Synonyms:
A-1325912.0 Pibrentasvir
Type:
Small organic molecule
Emp. Form.:
C57H65F5N10O8
Mol. Mass.:
1113.1802
SMILES:
CO[C@H](C)[C@H](NC(=O)OC)C(=O)N1CCC[C@H]1c1nc2cc([C@H]3CC[C@@H](N3c3cc(F)c(N4CCC(CC4)c4ccc(F)cc4)c(F)c3)c3cc4nc([nH]c4cc3F)[C@@H]3CCCN3C(=O)[C@@H](NC(=O)OC)[C@@H](C)OC)c(F)cc2[nH]1
: