Target
Carbonic anhydrase 6
Ligand
BDBM50454305
Substrate
Meas. Tech.
ChEMBL_1752589 (CHEMBL4187349)
Kd
17±n/a nM
Citation
 ?apkauskait?, EZak?auskas, ARuibys, VLinkuvien?, VPaketuryt?, VGedgaudas, MKairys, VMatulis, D Benzimidazole design, synthesis, and docking to build selective carbonic anhydrase VA inhibitors. Bioorg Med Chem 26:675-687 (2018)  
Target
Name:
Carbonic anhydrase 6
Synonyms:
CA-VI CAH6_HUMAN Carbonic Anhydrase VI Carbonic anhydrase 6 Carbonic anhydrase 6 (CA-VI) Salivary carbonic anhydrase | Secreted carbonic anhydrase
Type:
Enzyme
Mol. Mass.:
35371.40
Organism:
Homo sapiens (Human)
Description:
P23280
Residue:
308
  
Inhibitor
Name:
BDBM50454305
Synonyms:
CHEMBL4210750
Type:
Small organic molecule
Emp. Form.:
C17H15Cl2N3O3S
Mol. Mass.:
412.29
SMILES:
Cc1cc2ncn(CC(=O)c3cc(c(Cl)cc3Cl)S(N)(=O)=O)c2cc1C
: