Target
Carbonic anhydrase 5B, mitochondrial
Ligand
BDBM50454306
Substrate
Meas. Tech.
ChEMBL_1752588 (CHEMBL4187348)
Kd
0.780000±n/a nM
Citation
 ?apkauskait?, EZak?auskas, ARuibys, VLinkuvien?, VPaketuryt?, VGedgaudas, MKairys, VMatulis, D Benzimidazole design, synthesis, and docking to build selective carbonic anhydrase VA inhibitors. Bioorg Med Chem 26:675-687 (2018)  
Target
Name:
Carbonic anhydrase 5B, mitochondrial
Synonyms:
CA-VB CAH5B_HUMAN Carbonic Anhydrase VB Carbonic anhydrase 5B, mitochondrial Carbonic anhydrase V | Carbonic anhydrase VB (CA VB)
Type:
Enzyme
Mol. Mass.:
36440.83
Organism:
Homo sapiens (Human)
Description:
Human (cloned) isozyme
Residue:
317
  
Inhibitor
Name:
BDBM50454306
Synonyms:
CHEMBL4218335
Type:
Small organic molecule
Emp. Form.:
C20H15ClN4O3S2
Mol. Mass.:
458.941
SMILES:
NS(=O)(=O)c1cc(C(=O)Nn2cnc3ccccc23)c(Sc2ccccc2)cc1Cl
: