Target
Carbonic anhydrase 12
Ligand
BDBM50454306
Substrate
Meas. Tech.
ChEMBL_1752580 (CHEMBL4187340)
Kd
500±n/a nM
Citation
 ?apkauskait?, EZak?auskas, ARuibys, VLinkuvien?, VPaketuryt?, VGedgaudas, MKairys, VMatulis, D Benzimidazole design, synthesis, and docking to build selective carbonic anhydrase VA inhibitors. Bioorg Med Chem 26:675-687 (2018)  
Target
Name:
Carbonic anhydrase 12
Synonyms:
CA-XII CAH12_HUMAN Carbonic anhydrase Carbonic anhydrase XII Carbonic anhydrase XII (CAXII) | Tumor antigen HOM-RCC-3.1.3
Type:
Enzyme
Mol. Mass.:
39456.00
Organism:
Homo sapiens (Human)
Description:
Catalytic domain of human cloned isozyme was used in the assay
Residue:
354
  
Inhibitor
Name:
BDBM50454306
Synonyms:
CHEMBL4218335
Type:
Small organic molecule
Emp. Form.:
C20H15ClN4O3S2
Mol. Mass.:
458.941
SMILES:
NS(=O)(=O)c1cc(C(=O)Nn2cnc3ccccc23)c(Sc2ccccc2)cc1Cl
: