Target
Carbonic anhydrase 5B, mitochondrial
Ligand
BDBM50454305
Substrate
Meas. Tech.
ChEMBL_1752576 (CHEMBL4187336)
Kd
2500±n/a nM
Citation
 ?apkauskait?, EZak?auskas, ARuibys, VLinkuvien?, VPaketuryt?, VGedgaudas, MKairys, VMatulis, D Benzimidazole design, synthesis, and docking to build selective carbonic anhydrase VA inhibitors. Bioorg Med Chem 26:675-687 (2018)  
Target
Name:
Carbonic anhydrase 5B, mitochondrial
Synonyms:
CA-VB CAH5B_HUMAN Carbonic Anhydrase VB Carbonic anhydrase 5B, mitochondrial Carbonic anhydrase V | Carbonic anhydrase VB (CA VB)
Type:
Enzyme
Mol. Mass.:
36440.83
Organism:
Homo sapiens (Human)
Description:
Human (cloned) isozyme
Residue:
317
  
Inhibitor
Name:
BDBM50454305
Synonyms:
CHEMBL4210750
Type:
Small organic molecule
Emp. Form.:
C17H15Cl2N3O3S
Mol. Mass.:
412.29
SMILES:
Cc1cc2ncn(CC(=O)c3cc(c(Cl)cc3Cl)S(N)(=O)=O)c2cc1C
: