Target
Probable maltase-glucoamylase 2
Ligand
BDBM50241453
Substrate
Meas. Tech.
ChEMBL_1752596 (CHEMBL4187356)
IC50
1700±n/a nM
Citation
 Li, ZPSong, YHUddin, ZWang, YPark, KH Inhibition of protein tyrosine phosphatase 1B (PTP1B) and ?-glucosidase by xanthones from Cratoxylum cochinchinense, and their kinetic characterization. Bioorg Med Chem 26:737-746 (2018)  
Target
Name:
Probable maltase-glucoamylase 2
Synonyms:
3.2.1.3 Glucoamylase MGAM2 Probable maltase-glucoamylase 2
Type:
PROTEIN
Mol. Mass.:
277932.17
Organism:
Homo sapiens
Description:
ChEMBL_116927
Residue:
2515
  
Inhibitor
Name:
BDBM50241453
Synonyms:
1,3,6,7-tetrahydroxy-2,8-bis(3-methylbut-2-enyl)-9H-xanthen-9-one gamma-mangostin
Type:
Small organic molecule
Emp. Form.:
C23H24O6
Mol. Mass.:
396.4331
SMILES:
[#6]\[#6](-[#6])=[#6]\[#6]-c1c(-[#8])cc2oc3cc(-[#8])c(-[#8])c(-[#6]\[#6]=[#6](\[#6])-[#6])c3c(=O)c2c1-[#8]
: