Target
NACHT, LRR and PYD domains-containing protein 3
Ligand
BDBM50155926
Substrate
Meas. Tech.
ChEMBL_1752784 (CHEMBL4187544)
IC50
5.0±n/a nM
Citation
 Salla, MButler, MSMassey, NLReid, JCCooper, MARobertson, AAB Synthesis of deuterium-labelled analogues of NLRP3 inflammasome inhibitor MCC950. Bioorg Med Chem Lett 28:793-795 (2018)  
Target
Name:
NACHT, LRR and PYD domains-containing protein 3
Synonyms:
C1orf7 NALP3 NLRP3 protein PYPAF1
Type:
Enzyme Catalytic Domain
Mol. Mass.:
118173.88
Organism:
Homo sapiens (Human)
Description:
Q96P20
Residue:
1036
  
Inhibitor
Name:
BDBM50155926
Synonyms:
CHEMBL3183703
Type:
Small organic molecule
Emp. Form.:
C20H24N2O5S
Mol. Mass.:
404.48
SMILES:
CC(C)(O)c1coc(c1)S(=O)(=O)NC(=O)Nc1c2CCCc2cc2CCCc12
: