Target
Amine oxidase [flavin-containing] B
Ligand
BDBM50172756
Substrate
Meas. Tech.
ChEMBL_1757770 (CHEMBL4192778)
IC50
8.2±n/a nM
Citation
 Yang, HLCai, PLiu, QHYang, XLLi, FWang, JWu, JJWang, XBKong, LY Design, synthesis and evaluation of coumarin-pargyline hybrids as novel dual inhibitors of monoamine oxidases and amyloid-? aggregation for the treatment of Alzheimer's disease. Eur J Med Chem 138:715-728 (2017)  
Target
Name:
Amine oxidase [flavin-containing] B
Synonyms:
AOFB_HUMAN MAOB Monoamine oxidase type B (MAO B) Monoamine oxidase type B (MAOB)
Type:
Protein
Mol. Mass.:
58768.76
Organism:
Homo sapiens (Human)
Description:
P27338
Residue:
520
  
Inhibitor
Name:
BDBM50172756
Synonyms:
Benzyl-methyl-prop-2-ynyl-amine Eutonyl N-benzyl-N-methylprop-2-yn-1-amine US9603833, Pargyline
Type:
Small organic molecule
Emp. Form.:
C11H13N
Mol. Mass.:
159.2276
SMILES:
CN(CC#C)Cc1ccccc1
: