Target
Amine oxidase [flavin-containing] A
Ligand
BDBM50456650
Substrate
Meas. Tech.
ChEMBL_1757752 (CHEMBL4192760)
IC50
55050±n/a nM
Citation
 Yang, HLCai, PLiu, QHYang, XLLi, FWang, JWu, JJWang, XBKong, LY Design, synthesis and evaluation of coumarin-pargyline hybrids as novel dual inhibitors of monoamine oxidases and amyloid-? aggregation for the treatment of Alzheimer's disease. Eur J Med Chem 138:715-728 (2017)  
Target
Name:
Amine oxidase [flavin-containing] A
Synonyms:
AOFA_HUMAN MAO-A Monoamine oxidase Monoamine oxidase type A (MAO A) Monoamine oxidase type A (MAOA)
Type:
Protein
Mol. Mass.:
59689.53
Organism:
Homo sapiens (Human)
Description:
P21397
Residue:
527
  
Inhibitor
Name:
BDBM50456650
Synonyms:
CHEMBL4216146
Type:
Small organic molecule
Emp. Form.:
C22H21NO4
Mol. Mass.:
363.4064
SMILES:
COc1ccc(CN(CCOc2ccc3ccc(=O)oc3c2)CC#C)cc1
: