Target
Amine oxidase [flavin-containing] A
Ligand
BDBM50456652
Substrate
Meas. Tech.
ChEMBL_1757752 (CHEMBL4192760)
IC50
49170±n/a nM
Citation
 Yang, HLCai, PLiu, QHYang, XLLi, FWang, JWu, JJWang, XBKong, LY Design, synthesis and evaluation of coumarin-pargyline hybrids as novel dual inhibitors of monoamine oxidases and amyloid-? aggregation for the treatment of Alzheimer's disease. Eur J Med Chem 138:715-728 (2017)  
Target
Name:
Amine oxidase [flavin-containing] A
Synonyms:
AOFA_HUMAN MAO-A Monoamine oxidase Monoamine oxidase type A (MAO A) Monoamine oxidase type A (MAOA)
Type:
Protein
Mol. Mass.:
59689.53
Organism:
Homo sapiens (Human)
Description:
P21397
Residue:
527
  
Inhibitor
Name:
BDBM50456652
Synonyms:
CHEMBL4211764
Type:
Small organic molecule
Emp. Form.:
C22H19F2NO3
Mol. Mass.:
383.388
SMILES:
Fc1ccc(CN(CCCOc2ccc3ccc(=O)oc3c2)CC#C)cc1F
: