Target
Cyclin-dependent kinase 4/G1/S-specific cyclin-E1
Ligand
BDBM50458034
Substrate
Meas. Tech.
ChEMBL_1761785 (CHEMBL4197032)
IC50
2.2±n/a nM
Citation
 Zha, CDeng, WFu, YTang, SLan, XYe, YSu, YJiang, LChen, YHuang, YDing, JGeng, MHuang, MWan, H Design, synthesis and biological evaluation of tetrahydronaphthyridine derivatives as bioavailable CDK4/6 inhibitors for cancer therapy. Eur J Med Chem 148:140-153 (2018)  
Target
Name:
Cyclin-dependent kinase 4/G1/S-specific cyclin-E1
Synonyms:
CDK4/E1 | Cyclin-dependent kinase 4/G1/S-specific cyclin-E1
Type:
Protein
Mol. Mass.:
Description:
Components:
This complex has 2 components.
Component 1
Name:
Cyclin-dependent kinase 4
Synonyms:
CDK4 Cell division protein kinase 4 PSK-J3
Type:
Enzyme Subunit
Mol. Mass.:
33731.96
Organism:
Homo sapiens (Human)
Description:
P11802
Residue:
303
  
Component 2
Name:
G1/S-specific cyclin-E1
Synonyms:
CCNE CCNE1_HUMAN
Type:
Enzyme Subunit
Mol. Mass.:
47073.17
Organism:
Homo sapiens (Human)
Description:
Residue:
410
  
Inhibitor
Name:
BDBM50458034
Synonyms:
CHEMBL4212532 US10988476, Compound I-5
Type:
Small organic molecule
Emp. Form.:
C27H30F2N8O
Mol. Mass.:
520.5769
SMILES:
CC(C)n1c(C)nc2c(F)cc(cc12)-c1nc(Nc2ccc3CN(CCc3n2)C(=O)CN(C)C)ncc1F
: