Target
Smoothened homolog
Ligand
BDBM50249522
Substrate
Meas. Tech.
ChEMBL_1762629 (CHEMBL4197876)
IC50
6.0±n/a nM
Citation
 Ma, HChen, QZhu, FZheng, JLi, JZhang, HChen, SXing, HLuo, LZheng, LTHe, SZhang, X Discovery and characterization of a potent Wnt and hedgehog signaling pathways dual inhibitor. Eur J Med Chem 149:110-121 (2018)  
Target
Name:
Smoothened homolog
Synonyms:
SMO_MOUSE Smoh
Type:
PROTEIN
Mol. Mass.:
87472.73
Organism:
Mus musculus
Description:
ChEMBL_1510377
Residue:
793
  
Inhibitor
Name:
BDBM50249522
Synonyms:
2-chloro-N-(4-chloro-3-(pyridin-2-yl)phenyl)-4-(methylsulfonyl)benzamide VISMODEGIB
Type:
Small organic molecule
Emp. Form.:
C19H14Cl2N2O3S
Mol. Mass.:
421.297
SMILES:
CS(=O)(=O)c1ccc(C(=O)Nc2ccc(Cl)c(c2)-c2ccccn2)c(Cl)c1
: