Target
5-hydroxytryptamine receptor 7
Ligand
BDBM21392
Substrate
Meas. Tech.
ChEMBL_1764020 (CHEMBL4199267)
Ki
0.930000±n/a nM
Citation
 Modica, MNLacivita, EIntagliata, SSalerno, LRomeo, GPittalą, VLeopoldo, M Structure-Activity Relationships and Therapeutic Potentials of 5-HT J Med Chem 61:8475-8503 (2018)  
Target
Name:
5-hydroxytryptamine receptor 7
Synonyms:
5-HT-7 5-HT7 5-HT7S 5HT7 HTR7 | Serotonin receptor 7
Type:
G Protein-Coupled Receptor (GPCR)
Mol. Mass.:
53573.08
Organism:
Homo sapiens (Human)
Description:
P34969
Residue:
479
  
Inhibitor
Name:
BDBM21392
Synonyms:
3-(2-aminoethyl)-1H-indole-5-carboxamide 5-CT,DP CHEMBL1256863 [3H]-5-CT [3H]-5-Carboxyamidotryptamine | [3H]-5-carboxamidotryptamine
Type:
Small organic molecule
Emp. Form.:
C11H13N3O
Mol. Mass.:
203.2404
SMILES:
NCCc1c[nH]c2ccc(cc12)C(N)=O
: