Target
Genome polyprotein/Non-structural protein 4A
Ligand
BDBM50458709
Substrate
Meas. Tech.
ChEMBL_1764525 (CHEMBL4199772)
Ki
21±n/a nM
Citation
 Rusere, LNMatthew, ANLockbaum, GJJahangir, MNewton, APetropoulos, CJHuang, WKurt Yilmaz, NSchiffer, CAAli, A Quinoxaline-Based Linear HCV NS3/4A Protease Inhibitors Exhibit Potent Activity against Drug Resistant Variants. ACS Med Chem Lett 9:691-696 (2018)  
Target
Name:
Genome polyprotein/Non-structural protein 4A
Synonyms:
Hepatitis C virus serine protease, NS3/NS4A
Type:
Mol. Mass.:
Description:
ASSAY_ID of ChEMBL is 1969955
Components:
This complex has 2 components.
Component 1
Name:
Non-structural protein 4A
Synonyms:
Hepatitis C virus NS4A protein Non-structural protein 4A
Type:
PROTEIN
Mol. Mass.:
5762.65
Organism:
Hepatitis C virus
Description:
ChEMBL_305334
Residue:
54
  
Component 2
Name:
Genome polyprotein
Synonyms:
Hepatitis C virus NS3 protease/helicase | Hepatitis C virus serine protease, NS3/NS4A
Type:
Protein
Mol. Mass.:
67067.41
Organism:
Hepatitis C virus
Description:
A3EZI9
Residue:
631
  
Inhibitor
Name:
BDBM50458709
Synonyms:
CHEMBL4205968
Type:
Small organic molecule
Emp. Form.:
C39H54N6O9S
Mol. Mass.:
782.946
SMILES:
COc1ccc2nc(C(C)C)c(O[C@@H]3C[C@H](N(C3)C(=O)[C@@H](NC(=O)OC3CCCC3)C(C)(C)C)C(=O)N[C@@]3(C[C@H]3C=C)C(=O)NS(=O)(=O)C3(C)CC3)nc2c1
: