Target
Albumin
Ligand
BDBM50197883
Substrate
Meas. Tech.
ChEMBL_1765444 (CHEMBL4200691)
Kd
2300±n/a nM
Citation
 Miller, MPal, AAlbusairi, WJoo, HPappas, BHaque Tuhin, MTLiang, DJampala, RLiu, FKhan, JFaaij, MPark, MChan, WGraef, IZamboni, RKumar, NFox, JSinha, UAlhamadsheh, M Enthalpy-Driven Stabilization of Transthyretin by AG10 Mimics a Naturally Occurring Genetic Variant That Protects from Transthyretin Amyloidosis. J Med Chem 61:7862-7876 (2018)  
Target
Name:
Albumin
Synonyms:
ALB Serum albumin
Type:
PROTEIN
Mol. Mass.:
69362.94
Organism:
Homo sapiens (Human)
Description:
ChEMBL_1509401
Residue:
609
  
Inhibitor
Name:
BDBM50197883
Synonyms:
CHEBI:78538 Tafamidis Vyndaqel
Type:
Small organic molecule
Emp. Form.:
C14H7Cl2NO3
Mol. Mass.:
308.116
SMILES:
OC(=O)c1ccc2nc(oc2c1)-c1cc(Cl)cc(Cl)c1
: