Target
Tyrosine-protein kinase ABL1
Ligand
BDBM222504
Substrate
Meas. Tech.
ChEMBL_1765492 (CHEMBL4200739)
IC50
19±n/a nM
Citation
 Schoepfer, JJahnke, WBerellini, GBuonamici, SCotesta, SCowan-Jacob, SWDodd, SDrueckes, PFabbro, DGabriel, TGroell, JMGrotzfeld, RMHassan, AQHenry, CIyer, VJones, DLombardo, FLoo, AManley, PWPellé, XRummel, GSalem, BWarmuth, MWylie, AAZoller, TMarzinzik, ALFuret, P Discovery of Asciminib (ABL001), an Allosteric Inhibitor of the Tyrosine Kinase Activity of BCR-ABL1. J Med Chem 61:8120-8135 (2018)  
Target
Name:
Tyrosine-protein kinase ABL1
Synonyms:
ABL ABL1_HUMAN JTK7 Proto-oncogene tyrosine-protein kinase ABL1 Tyrosine-protein kinase ABL V-abl Abelson murine leukemia viral oncogene homolog 1 p150 | tyrosine-protein kinase ABL1 isoform a
Type:
Enzyme
Mol. Mass.:
122897.30
Organism:
Homo sapiens (Human)
Description:
P00519
Residue:
1130
  
Inhibitor
Name:
BDBM222504
Synonyms:
US9315489, 40
Type:
Small organic molecule
Emp. Form.:
C24H23F3N4O3
Mol. Mass.:
472.4596
SMILES:
FC(F)(F)Oc1ccc(NC(=O)c2ccc(OCCN3CCCC3)c(c2)-c2cncnc2)cc1
: