Target
Cytochrome P450 3A4
Ligand
BDBM50459091
Substrate
Meas. Tech.
ChEMBL_1765548 (CHEMBL4200795)
IC50
>20000±n/a nM
Citation
 Schoepfer, JJahnke, WBerellini, GBuonamici, SCotesta, SCowan-Jacob, SWDodd, SDrueckes, PFabbro, DGabriel, TGroell, JMGrotzfeld, RMHassan, AQHenry, CIyer, VJones, DLombardo, FLoo, AManley, PWPellé, XRummel, GSalem, BWarmuth, MWylie, AAZoller, TMarzinzik, ALFuret, P Discovery of Asciminib (ABL001), an Allosteric Inhibitor of the Tyrosine Kinase Activity of BCR-ABL1. J Med Chem 61:8120-8135 (2018)  
Target
Name:
Cytochrome P450 3A4
Synonyms:
Albendazole monooxygenase CP3A4_HUMAN CYP3A4 CYPIIIA4 Cytochrome P450 3A4 (CYP3A4) Nifedipine oxidase Taurochenodeoxycholate 6-alpha-hydroxylase
Type:
Enzyme
Mol. Mass.:
57349.57
Organism:
Homo sapiens (Human)
Description:
Residue:
503
  
Inhibitor
Name:
BDBM50459091
Synonyms:
ABL-001 ABL001-NX NVP-ABL001 | US11649218, Example ABL-001
Type:
Small organic molecule
Emp. Form.:
C20H18ClF2N5O3
Mol. Mass.:
449.838
SMILES:
O[C@@H]1CCN(C1)c1ncc(cc1-c1cc[nH]n1)C(=O)Nc1ccc(OC(F)(F)Cl)cc1
: