Target
Tyrosine-protein kinase ABL1
Ligand
BDBM50459091
Substrate
Meas. Tech.
ChEMBL_1765492 (CHEMBL4200739)
IC50
0.500000±n/a nM
Citation
 Schoepfer, JJahnke, WBerellini, GBuonamici, SCotesta, SCowan-Jacob, SWDodd, SDrueckes, PFabbro, DGabriel, TGroell, JMGrotzfeld, RMHassan, AQHenry, CIyer, VJones, DLombardo, FLoo, AManley, PWPellé, XRummel, GSalem, BWarmuth, MWylie, AAZoller, TMarzinzik, ALFuret, P Discovery of Asciminib (ABL001), an Allosteric Inhibitor of the Tyrosine Kinase Activity of BCR-ABL1. J Med Chem 61:8120-8135 (2018)  
Target
Name:
Tyrosine-protein kinase ABL1
Synonyms:
ABL ABL1_HUMAN JTK7 Proto-oncogene tyrosine-protein kinase ABL1 Tyrosine-protein kinase ABL V-abl Abelson murine leukemia viral oncogene homolog 1 p150 | tyrosine-protein kinase ABL1 isoform a
Type:
Enzyme
Mol. Mass.:
122897.30
Organism:
Homo sapiens (Human)
Description:
P00519
Residue:
1130
  
Inhibitor
Name:
BDBM50459091
Synonyms:
ABL-001 ABL001-NX NVP-ABL001 | US11649218, Example ABL-001
Type:
Small organic molecule
Emp. Form.:
C20H18ClF2N5O3
Mol. Mass.:
449.838
SMILES:
O[C@@H]1CCN(C1)c1ncc(cc1-c1cc[nH]n1)C(=O)Nc1ccc(OC(F)(F)Cl)cc1
: