Target
Adenosine receptor A2a/A2b
Ligand
BDBM50227193
Substrate
Meas. Tech.
ChEMBL_184451 (CHEMBL789405)
Ki
130000±n/a nM
Citation
 Peet, NPDickerson, GAAbdallah, AHDaly, JWUkena, D Benzo[1,2-c:5,4-c']dipyrazoles: non-xanthine adenosine antagonists. J Med Chem 31:2034-9 (1988)  
Target
Name:
Adenosine receptor A2a/A2b
Synonyms:
Adenosine A2 receptor
Type:
Mol. Mass.:
Description:
ASSAY_ID of ChEMBL is 30560
Components:
This complex has 2 components.
Component 1
Name:
Adenosine receptor A2b
Synonyms:
AA2BR_RAT Adora2b
Type:
PROTEIN
Mol. Mass.:
36378.84
Organism:
Rattus norvegicus
Description:
ChEMBL_32934
Residue:
332
  
Component 2
Name:
Adenosine receptor A2a
Synonyms:
AA2AR_RAT Adenosine A2 receptor Adenosine Receptors A2a (A2a) Adenosine receptors A2a Rat striatal adenosine A2a receptor
Type:
G Protein-Coupled Receptor (GPCR)
Mol. Mass.:
45015.65
Organism:
Rattus norvegicus (rat)
Description:
Rat A2A receptors expressed in CHO cells.
Residue:
410
  
Inhibitor
Name:
BDBM50227193
Synonyms:
CHEBI:17712 | Xanthine
Type:
Small organic molecule
Emp. Form.:
C5H4N4O2
Mol. Mass.:
152.1109
SMILES:
O=c1[nH]c2[nH]cnc2c(=O)[nH]1
: