Target
Amyloid-beta precursor protein
Ligand
BDBM50041457
Substrate
Meas. Tech.
ChEMBL_1770541 (CHEMBL4222653)
IC50
4000±n/a nM
Citation
 Gay, MCarato, PCoevoet, MRenault, NLarchanché, PEBarczyk, AYous, SBuée, LSergeant, NMelnyk, P New phenylaniline derivatives as modulators of amyloid protein precursor metabolism. Bioorg Med Chem 26:2151-2164 (2018)  
Target
Name:
Amyloid-beta precursor protein
Synonyms:
A4 ABPP AICD-50 AICD-59 AID(57) APP Alzheimer disease amyloid protein Amyloid beta Protein Amyloid beta protein Abeta(1-42) Amyloid intracellular domain 57 Amyloid protein (Abeta42b) Beta amyloid A4 protein Beta-APP42 Beta-amyloid protein 42 C83 CVAP Gamma Secretase Gamma-CTF(57) Gamma-secretase Gamma-secretase C-terminal fragment 57 P3(40) PN-II Protease nexin-II S-APP-beta Soluble APP-beta | beta-Amyloid Precursor Protein (APP)
Type:
Single-pass type I membrane protein
Mol. Mass.:
86890.41
Organism:
Homo sapiens (Human)
Description:
P05067
Residue:
770
  
Inhibitor
Name:
BDBM50041457
Synonyms:
4-[(7-chloroquinolin-4-yl)amino]-2-[(diethylamino)methyl]phenol CHEMBL682 | med.21724, Compound 188
Type:
Small organic molecule
Emp. Form.:
C20H22ClN3O
Mol. Mass.:
355.861
SMILES:
CCN(CC)Cc1cc(Nc2ccnc3cc(Cl)ccc23)ccc1O
: