Target
Bromodomain-containing protein 4
Ligand
BDBM50461595
Substrate
Meas. Tech.
ChEMBL_1771644 (CHEMBL4223756)
IC50
30000±n/a nM
Citation
 Bennett, MJWu, YBoloor, AMatuszkiewicz, JO'Connell, SMShi, LStansfield, RKDel Rosario, JRVeal, JMHosfield, DJXu, JKaldor, SWStafford, JABetancort, JM Design, synthesis and biological evaluation of novel 4-phenylisoquinolinone BET bromodomain inhibitors. Bioorg Med Chem Lett 28:1811-1816 (2018)  
Target
Name:
Bromodomain-containing protein 4
Synonyms:
BRD4 Bromodomain-containing protein 4 (BRD4) Protein HUNK1
Type:
Protein
Mol. Mass.:
152264.84
Organism:
Homo sapiens (Human)
Description:
O60885
Residue:
1362
  
Inhibitor
Name:
BDBM50461595
Synonyms:
CHEMBL4225096
Type:
Small organic molecule
Emp. Form.:
C12H11NO3
Mol. Mass.:
217.2206
SMILES:
COC(=O)c1cn(C)c(=O)c2ccccc12
: