Target
Bromodomain-containing protein 4
Ligand
BDBM285167
Substrate
Meas. Tech.
ChEMBL_1771645 (CHEMBL4223757)
IC50
9.0±n/a nM
Citation
 Bennett, MJWu, YBoloor, AMatuszkiewicz, JO'Connell, SMShi, LStansfield, RKDel Rosario, JRVeal, JMHosfield, DJXu, JKaldor, SWStafford, JABetancort, JM Design, synthesis and biological evaluation of novel 4-phenylisoquinolinone BET bromodomain inhibitors. Bioorg Med Chem Lett 28:1811-1816 (2018)  
Target
Name:
Bromodomain-containing protein 4
Synonyms:
BRD4 Bromodomain-containing protein 4 (BRD4) Protein HUNK1
Type:
Protein
Mol. Mass.:
152264.84
Organism:
Homo sapiens (Human)
Description:
O60885
Residue:
1362
  
Inhibitor
Name:
BDBM285167
Synonyms:
2-methyl-6-(1-methylpyrazol-4-yl)-4-(5- methylsulfonyl-2- propoxyphenyl)isoquinolin-1-one US10023592, Example 212
Type:
Small organic molecule
Emp. Form.:
C24H25N3O4S
Mol. Mass.:
451.538
SMILES:
CCCOc1ccc(cc1-c1cn(C)c(=O)c2ccc(cc12)-c1cnn(C)c1)S(C)(=O)=O
: