Target
Bromodomain-containing protein 4
Ligand
BDBM285026
Substrate
Meas. Tech.
ChEMBL_1771644 (CHEMBL4223756)
IC50
11500±n/a nM
Citation
 Bennett, MJWu, YBoloor, AMatuszkiewicz, JO'Connell, SMShi, LStansfield, RKDel Rosario, JRVeal, JMHosfield, DJXu, JKaldor, SWStafford, JABetancort, JM Design, synthesis and biological evaluation of novel 4-phenylisoquinolinone BET bromodomain inhibitors. Bioorg Med Chem Lett 28:1811-1816 (2018)  
Target
Name:
Bromodomain-containing protein 4
Synonyms:
BRD4 Bromodomain-containing protein 4 (BRD4) Protein HUNK1
Type:
Protein
Mol. Mass.:
152264.84
Organism:
Homo sapiens (Human)
Description:
O60885
Residue:
1362
  
Inhibitor
Name:
BDBM285026
Synonyms:
2-methyl-4-pyrimidin-2-ylisoquinolin- 1-one US10941160, Example 71
Type:
Small organic molecule
Emp. Form.:
C14H11N3O
Mol. Mass.:
237.2566
SMILES:
Cn1cc(-c2ncccn2)c2ccccc2c1=O
: