Target
Bromodomain-containing protein 4
Ligand
BDBM284997
Substrate
Meas. Tech.
ChEMBL_1771644 (CHEMBL4223756)
IC50
50±n/a nM
Citation
 Bennett, MJWu, YBoloor, AMatuszkiewicz, JO'Connell, SMShi, LStansfield, RKDel Rosario, JRVeal, JMHosfield, DJXu, JKaldor, SWStafford, JABetancort, JM Design, synthesis and biological evaluation of novel 4-phenylisoquinolinone BET bromodomain inhibitors. Bioorg Med Chem Lett 28:1811-1816 (2018)  
Target
Name:
Bromodomain-containing protein 4
Synonyms:
BRD4 Bromodomain-containing protein 4 (BRD4) Protein HUNK1
Type:
Protein
Mol. Mass.:
152264.84
Organism:
Homo sapiens (Human)
Description:
O60885
Residue:
1362
  
Inhibitor
Name:
BDBM284997
Synonyms:
N-[3-[2-methyl-6-(1-methylpyrazol-4-yl)-1- oxoisoquinolin-4-yl] phenyl]methanesulfonamide | US10023592, Example 42
Type:
Small organic molecule
Emp. Form.:
C21H20N4O3S
Mol. Mass.:
408.473
SMILES:
Cn1cc(cn1)-c1ccc2c(c1)c(cn(C)c2=O)-c1cccc(NS(C)(=O)=O)c1
: