Target
Cathepsin K
Ligand
BDBM50463235
Substrate
Meas. Tech.
ChEMBL_1777933 (CHEMBL4234925)
IC50
200±n/a nM
Citation
 Tber, ZWartenberg, MJacques, JERoy, VLecaille, FWarszycki, DBojarski, AJLalmanach, GAgrofoglio, LA Selective inhibition of human cathepsin S by 2,4,6-trisubstituted 1,3,5-triazine analogs. Bioorg Med Chem 26:4310-4319 (2018)  
Target
Name:
Cathepsin K
Synonyms:
CATK_HUMAN CTSO Cathepsin O Cathepsin X
Type:
Enzyme
Mol. Mass.:
36975.68
Organism:
Homo sapiens (Human)
Description:
P43235
Residue:
329
  
Inhibitor
Name:
BDBM50463235
Synonyms:
CHEMBL4238536
Type:
Small organic molecule
Emp. Form.:
C15H16N6O2
Mol. Mass.:
312.3265
SMILES:
COc1cccc(Nc2nc(nc(n2)N2CCOCC2)C#N)c1
: