Target
Nuclear receptor ROR-alpha
Ligand
BDBM19993
Substrate
Meas. Tech.
ChEMBL_1778218 (CHEMBL4235210)
IC50
11000±n/a nM
Citation
 Toyama, HShirakawa, HKomai, MHashimoto, YFujii, S Development of novel silanol-based human pregnane X receptor (PXR) agonists with improved receptor selectivity. Bioorg Med Chem 26:4493-4501 (2018)  
Target
Name:
Nuclear receptor ROR-alpha
Synonyms:
NR1F1 Nuclear receptor subfamily 1 group F member 1 RORA RZRA | Retinoid-related orphan receptor-alpha
Type:
PROTEIN
Mol. Mass.:
58976.26
Organism:
Homo sapiens (Human)
Description:
ChEMBL_101591
Residue:
523
  
Inhibitor
Name:
BDBM19993
Synonyms:
CHEMBL62136 T 0901317 TO-901317 US10669296, Compound TO901317 [3H]T0901317
Type:
Small organic molecule
Emp. Form.:
C17H12F9NO3S
Mol. Mass.:
481.333
SMILES:
OC(c1ccc(cc1)N(CC(F)(F)F)S(=O)(=O)c1ccccc1)(C(F)(F)F)C(F)(F)F
: