Target
Lysyl oxidase homolog 4
Ligand
BDBM50058655
Substrate
Meas. Tech.
ChEMBL_1778830 (CHEMBL4235822)
IC50
59±n/a nM
Citation
 Hajdú, IKardos, JMajor, BFabó, GL?rincz, ZCseh, SDormán, G Inhibition of the LOX enzyme family members with old and new ligands. Selectivity analysis revisited. Bioorg Med Chem Lett 28:3113-3118 (2018)  
Target
Name:
Lysyl oxidase homolog 4
Synonyms:
1.4.3.- LOXL4 Lysyl oxidase homolog 4 Lysyl oxidase-related protein C
Type:
PROTEIN
Mol. Mass.:
84498.74
Organism:
Homo sapiens
Description:
ChEMBL_118171
Residue:
756
  
Inhibitor
Name:
BDBM50058655
Synonyms:
1,1',1'',1'''-[disulfanediylbis(carbonothioylnitrilo)]tetraethane Antabuse (TN) DISULFIRAM N,N,N',N'-tetraethylthiuram disulfide US11753371, Compound II-2a-(Disulfiram) bis(diethylthiocarbamoyl) disulfide med.21724, Compound 151 tetraethylthiuram disulfide | tetraethylthiuram disulphide
Type:
Small organic molecule
Emp. Form.:
C10H20N2S4
Mol. Mass.:
296.539
SMILES:
CCN(CC)C(=S)SSC(=S)N(CC)CC
: