Target
Cannabinoid receptor 2
Ligand
BDBM50463772
Substrate
Meas. Tech.
ChEMBL_1779340 (CHEMBL4236332)
Ki
0.100000±n/a nM
Citation
 Malamas, MSRaghav, JGMa, XHonrao, CWood, JTBenchama, OZhou, HMallipeddi, SMakriyannis, A Oximes short-acting CB1 receptor agonists. Bioorg Med Chem 26:4963-4970 (2018)  
Target
Name:
Cannabinoid receptor 2
Synonyms:
CANNABINOID CB2 CB2 Cannabinoid CB2 receptor Cannabinoid receptor 2 mCB2
Type:
Enzyme Catalytic Domain
Mol. Mass.:
38220.43
Organism:
MOUSE
Description:
P47936
Residue:
347
  
Inhibitor
Name:
BDBM50463772
Synonyms:
CHEMBL4239190
Type:
Small organic molecule
Emp. Form.:
C22H28N2O3
Mol. Mass.:
368.4693
SMILES:
[H][C@]12CC(C)=CC[C@]1([H])C(C)(C)Oc1cc(cc(O)c21)C(\C)=N/OCCCC#N
: