Target
D(2) dopamine receptor/Metabotropic glutamate receptor 5
Ligand
BDBM50463980
Substrate
Meas. Tech.
ChEMBL_1779732 (CHEMBL4236724)
IC50
1800±n/a nM
Citation
 Qian, MWouters, EDalton, JARRisseeuw, MDPCrans, RAJStove, CGiraldo, JVan Craenenbroeck, KVan Calenbergh, S Synthesis toward Bivalent Ligands for the Dopamine D J Med Chem 61:8212-8225 (2018)  
Target
Name:
D(2) dopamine receptor/Metabotropic glutamate receptor 5
Synonyms:
Type:
Mol. Mass.:
Description:
ASSAY_ID of ChEMBL is 1779732
Components:
This complex has 2 components.
Component 1
Name:
D(2) dopamine receptor
Synonyms:
D(2) dopamine receptor DOPAMINE D2 Long DRD2 Dopamine D2 receptor Dopamine D2 receptor (D2R) Dopamine2-like | d2
Type:
Cell-surface receptors
Mol. Mass.:
50647.10
Organism:
Homo sapiens (Human)
Description:
P14416
Residue:
443
  
Component 2
Name:
Metabotropic glutamate receptor 5
Synonyms:
GPRC1E GRM5_HUMAN metabotropic glutamate 5 | metabotropic glutamate 5a
Type:
Enzyme
Mol. Mass.:
132484.72
Organism:
Homo sapiens (Human)
Description:
Residue:
1212
  
Inhibitor
Name:
BDBM50463980
Synonyms:
CHEMBL4246881
Type:
Small organic molecule
Emp. Form.:
C49H65N9O5S
Mol. Mass.:
892.163
SMILES:
COc1ccccc1N1CCN(Cc2ccc(OCc3cn(CCCCCCCCN(C)CCCCCNC(=O)COc4cncc(c4)C#Cc4csc(C)n4)nn3)c(OC)c2)CC1
: