Target
D(2) dopamine receptor/Metabotropic glutamate receptor 5
Ligand
BDBM50463984
Substrate
Meas. Tech.
ChEMBL_1779730 (CHEMBL4236722)
EC50
1.5±n/a nM
Citation
 Qian, MWouters, EDalton, JARRisseeuw, MDPCrans, RAJStove, CGiraldo, JVan Craenenbroeck, KVan Calenbergh, S Synthesis toward Bivalent Ligands for the Dopamine D J Med Chem 61:8212-8225 (2018)  
Target
Name:
D(2) dopamine receptor/Metabotropic glutamate receptor 5
Synonyms:
Type:
Mol. Mass.:
Description:
ASSAY_ID of ChEMBL is 1779732
Components:
This complex has 2 components.
Component 1
Name:
D(2) dopamine receptor
Synonyms:
D(2) dopamine receptor DOPAMINE D2 Long DRD2 Dopamine D2 receptor Dopamine D2 receptor (D2R) Dopamine2-like | d2
Type:
Cell-surface receptors
Mol. Mass.:
50647.10
Organism:
Homo sapiens (Human)
Description:
P14416
Residue:
443
  
Component 2
Name:
Metabotropic glutamate receptor 5
Synonyms:
GPRC1E GRM5_HUMAN metabotropic glutamate 5 | metabotropic glutamate 5a
Type:
Enzyme
Mol. Mass.:
132484.72
Organism:
Homo sapiens (Human)
Description:
Residue:
1212
  
Inhibitor
Name:
BDBM50463984
Synonyms:
CHEMBL4241844
Type:
Small organic molecule
Emp. Form.:
C53H71N9O4S
Mol. Mass.:
930.254
SMILES:
CCCN(CCc1ccc(NC(=O)CCc2cn(CCCCCCCCN(C)CCCCCNC(=O)COc3cncc(c3)C#Cc3csc(C)n3)nn2)cc1)C1CCc2c(O)cccc2C1
: