Target
Cannabinoid receptor 1
Ligand
BDBM50465033
Substrate
Meas. Tech.
ChEMBL_1783756 (CHEMBL4255273)
Ki
>10000±n/a nM
Citation
 Cooper, AGMacDonald, CGlass, MHook, STyndall, JDAVernall, AJ Alkyl indole-based cannabinoid type 2 receptor tools: Exploration of linker and fluorophore attachment. Eur J Med Chem 145:770-789 (2018)  
Target
Name:
Cannabinoid receptor 1
Synonyms:
CANN6 CB-R CNR CNR1_HUMAN Cannabinoid receptor Cannabinoid receptor 1 (brain)
Type:
G Protein-Coupled Receptor (GPCR)
Mol. Mass.:
52868.96
Organism:
Homo sapiens (Human)
Description:
P21554
Residue:
472
  
Inhibitor
Name:
BDBM50465033
Synonyms:
CHEMBL4277575
Type:
Small organic molecule
Emp. Form.:
C22H24N2O4
Mol. Mass.:
380.437
SMILES:
COc1ccc(cc1)C(=O)c1cn(CCN2CCOCC2)c2ccc(O)cc12
: