Target
Cannabinoid receptor 2
Ligand
BDBM50465033
Substrate
Meas. Tech.
ChEMBL_1783752 (CHEMBL4255269)
Ki
747±n/a nM
Citation
 Cooper, AGMacDonald, CGlass, MHook, STyndall, JDAVernall, AJ Alkyl indole-based cannabinoid type 2 receptor tools: Exploration of linker and fluorophore attachment. Eur J Med Chem 145:770-789 (2018)  
Target
Name:
Cannabinoid receptor 2
Synonyms:
CANNABINOID CB2 CB2 CB2B CNR2_HUMAN Cannabinoid CB2 receptor Cannabinoid receptor 2 (CB2R) | hCB2
Type:
G Protein-Coupled Receptor (GPCR)
Mol. Mass.:
39690.94
Organism:
Homo sapiens (Human)
Description:
P34972
Residue:
360
  
Inhibitor
Name:
BDBM50465033
Synonyms:
CHEMBL4277575
Type:
Small organic molecule
Emp. Form.:
C22H24N2O4
Mol. Mass.:
380.437
SMILES:
COc1ccc(cc1)C(=O)c1cn(CCN2CCOCC2)c2ccc(O)cc12
: