Target
Cannabinoid receptor 2
Ligand
BDBM50465028
Substrate
Meas. Tech.
ChEMBL_1783752 (CHEMBL4255269)
Ki
582±n/a nM
Citation
 Cooper, AGMacDonald, CGlass, MHook, STyndall, JDAVernall, AJ Alkyl indole-based cannabinoid type 2 receptor tools: Exploration of linker and fluorophore attachment. Eur J Med Chem 145:770-789 (2018)  
Target
Name:
Cannabinoid receptor 2
Synonyms:
CANNABINOID CB2 CB2 CB2B CNR2_HUMAN Cannabinoid CB2 receptor Cannabinoid receptor 2 (CB2R) | hCB2
Type:
G Protein-Coupled Receptor (GPCR)
Mol. Mass.:
39690.94
Organism:
Homo sapiens (Human)
Description:
P34972
Residue:
360
  
Inhibitor
Name:
BDBM50465028
Synonyms:
CHEMBL4279405
Type:
Small organic molecule
Emp. Form.:
C24H25NO6
Mol. Mass.:
423.4584
SMILES:
COc1ccc(cc1)C(=O)c1cn(CC2CCOCC2)c2c(OCC(O)=O)cccc12
: