Target
Cannabinoid receptor 2
Ligand
BDBM50465044
Substrate
Meas. Tech.
ChEMBL_1783752 (CHEMBL4255269)
Ki
>10000±n/a nM
Citation
 Cooper, AGMacDonald, CGlass, MHook, STyndall, JDAVernall, AJ Alkyl indole-based cannabinoid type 2 receptor tools: Exploration of linker and fluorophore attachment. Eur J Med Chem 145:770-789 (2018)  
Target
Name:
Cannabinoid receptor 2
Synonyms:
CANNABINOID CB2 CB2 CB2B CNR2_HUMAN Cannabinoid CB2 receptor Cannabinoid receptor 2 (CB2R) | hCB2
Type:
G Protein-Coupled Receptor (GPCR)
Mol. Mass.:
39690.94
Organism:
Homo sapiens (Human)
Description:
P34972
Residue:
360
  
Inhibitor
Name:
BDBM50465044
Synonyms:
CHEMBL4284520
Type:
Small organic molecule
Emp. Form.:
C62H66BF2N7O9S
Mol. Mass.:
1134.102
SMILES:
F[B-]1(F)n2c(ccc2-c2cccs2)C=C2C=CC(\C=C\c3ccc(OCC(=O)NCCCCCC(=O)NCCOCCOCCNC(=O)COc4ccc5n(CCN6CCOCC6)cc(C(=O)c6cccc7ccccc67)c5c4)cc3)=[N+]12
: