Target
Beta-1/Beta-2/Beta-3 adrenergic receptor
Ligand
BDBM50025124
Substrate
Meas. Tech.
ChEMBL_38579 (CHEMBL651204)
IC50
<1000±n/a nM
Citation
 Wouters, WJanssen, CGVan Dun, JThijssen, JBLaduron, PM In vitro labeling of serotonin-S2 receptors: synthesis and binding characteristics of [3H]-7-aminoketanserin. J Med Chem 29:1663-8 (1986)  
Target
Name:
Beta-1/Beta-2/Beta-3 adrenergic receptor
Synonyms:
Adrenergic receptor beta
Type:
Mol. Mass.:
Description:
ASSAY_ID of ChEMBL is 1340543
Components:
This complex has 3 components.
Component 1
Name:
Beta-1 adrenergic receptor
Synonyms:
ADRB1R, B1AR Adrb1 Adrenergic receptor beta Beta-1 adrenoreceptor adrenergic Beta1,2
Type:
Protein
Mol. Mass.:
50486.84
Organism:
Rattus norvegicus (Rat)
Description:
P18090
Residue:
466
  
Component 2
Name:
Beta-2 adrenergic receptor
Synonyms:
ADRB2_RAT Adrb2r | Adrenergic receptor beta
Type:
PROTEIN
Mol. Mass.:
46896.26
Organism:
Rattus norvegicus
Description:
ChEMBL_38603
Residue:
418
  
Component 3
Name:
Beta-3 adrenergic receptor
Synonyms:
ADRB3_RAT Adrb3r Beta-3 adrenergic receptor
Type:
PROTEIN
Mol. Mass.:
43161.83
Organism:
Rattus norvegicus
Description:
ChEMBL_1509452
Residue:
400
  
Inhibitor
Name:
BDBM50025124
Synonyms:
3-{2-[4-(4-Fluoro-benzoyl)-piperidin-1-yl]-ethyl}-7-hydroxy-1H-quinazoline-2,4-dione | CHEMBL46683
Type:
Small organic molecule
Emp. Form.:
C22H22FN3O4
Mol. Mass.:
411.4262
SMILES:
Oc1ccc2c(c1)[nH]c(=O)n(CCN1CCC(CC1)C(=O)c1ccc(F)cc1)c2=O
: