Target
Acetylcholinesterase
Ligand
BDBM50025010
Substrate
Meas. Tech.
ChEMBL_1789014 (CHEMBL4260748)
Ki
110000±n/a nM
Citation
 Zorbaz, TMalinak, DMarakovi?, NMa?ek Hrvat, NZandona, ANovotny, MSkarka, AAndrys, RBenkova, MSoukup, OKatalini?, MKuca, KKovarik, ZMusilek, K Pyridinium Oximes with Ortho-Positioned Chlorine Moiety Exhibit Improved Physicochemical Properties and Efficient Reactivation of Human Acetylcholinesterase Inhibited by Several Nerve Agents. J Med Chem 61:10753-10766 (2018)  
Target
Name:
Acetylcholinesterase
Synonyms:
ACES_HUMAN Acetylcholinesterase (AChE) | Acetylcholinesterase (human AChE)
Type:
Enzyme
Mol. Mass.:
67792.70
Organism:
Homo sapiens (Human)
Description:
P22303
Residue:
614
  
Inhibitor
Name:
BDBM50025010
Synonyms:
CHEMBL116379
Type:
Small organic molecule
Emp. Form.:
C16H20Br2N4O2
Mol. Mass.:
460.164
SMILES:
[Br-].[Br-].NC(=O)c1cc[n+](CCCC[n+]2ccc(\C=N\O)cc2)cc1
: