Target
Acetylcholinesterase
Ligand
BDBM50333782
Substrate
Meas. Tech.
ChEMBL_1789014 (CHEMBL4260748)
Ki
73000±n/a nM
Citation
 Zorbaz, TMalinak, DMarakovi?, NMa?ek Hrvat, NZandona, ANovotny, MSkarka, AAndrys, RBenkova, MSoukup, OKatalini?, MKuca, KKovarik, ZMusilek, K Pyridinium Oximes with Ortho-Positioned Chlorine Moiety Exhibit Improved Physicochemical Properties and Efficient Reactivation of Human Acetylcholinesterase Inhibited by Several Nerve Agents. J Med Chem 61:10753-10766 (2018)  
Target
Name:
Acetylcholinesterase
Synonyms:
ACES_HUMAN Acetylcholinesterase (AChE) | Acetylcholinesterase (human AChE)
Type:
Enzyme
Mol. Mass.:
67792.70
Organism:
Homo sapiens (Human)
Description:
P22303
Residue:
614
  
Inhibitor
Name:
BDBM50333782
Synonyms:
4-(aminocarbonyl)-1-(3-{4-[(E)-(hydroxyimino)methyl]pyridinium-1-yl}propyl)pyridinium dibromide 4-carbamoyl-1-(3-(4-((hydroxyimino)methyl)pyridinium-1-yl)propyl)pyridinium dibromide | CHEMBL397871
Type:
Small organic molecule
Emp. Form.:
C15H18N4O2
Mol. Mass.:
286.3279
SMILES:
NC(=O)c1cc[n+](CCC[n+]2ccc(CN=O)cc2)cc1
: