Target
Nuclear receptor ROR-gamma
Ligand
BDBM50466373
Substrate
Meas. Tech.
ChEMBL_1792870 (CHEMBL4264789)
IC50
260±n/a nM
Citation
 Sasaki, YOdan, MYamamoto, SKida, SUeyama, AShimizu, MHaruna, TWatanabe, AOkuno, T Discovery of a potent orally bioavailable retinoic acid receptor-related orphan receptor-gamma-t (ROR?t) inhibitor, S18-000003. Bioorg Med Chem Lett 28:3549-3553 (2018)  
Target
Name:
Nuclear receptor ROR-gamma
Synonyms:
NR1F3 Nuclear receptor ROR-gamma (RORC) RAR-related orphan receptor C (RORc) RORG RZRG Retinoid-related orphan receptor-gamma (RORc)
Type:
Enzyme Catalytic Domain
Mol. Mass.:
58218.40
Organism:
Homo sapiens (Human)
Description:
P51449
Residue:
518
  
Inhibitor
Name:
BDBM50466373
Synonyms:
CHEMBL4278285
Type:
Small organic molecule
Emp. Form.:
C28H30N2O4S
Mol. Mass.:
490.614
SMILES:
CCS(=O)(=O)c1ccc(CC(=O)Nc2ccc(cc2)C(C)(C)C(=O)N2Cc3ccccc3C2)cc1
: