Target
Nuclear receptor ROR-gamma
Ligand
BDBM50466367
Substrate
Meas. Tech.
ChEMBL_1792871 (CHEMBL4264790)
IC50
250±n/a nM
Citation
 Sasaki, YOdan, MYamamoto, SKida, SUeyama, AShimizu, MHaruna, TWatanabe, AOkuno, T Discovery of a potent orally bioavailable retinoic acid receptor-related orphan receptor-gamma-t (ROR?t) inhibitor, S18-000003. Bioorg Med Chem Lett 28:3549-3553 (2018)  
Target
Name:
Nuclear receptor ROR-gamma
Synonyms:
Nr1f3 Nuclear receptor subfamily 1 group F member 3 RORG_MOUSE Rorc TOR Thymus orphan receptor
Type:
PROTEIN
Mol. Mass.:
58133.31
Organism:
Mus musculus
Description:
ChEMBL_103664
Residue:
516
  
Inhibitor
Name:
BDBM50466367
Synonyms:
CHEMBL4290041
Type:
Small organic molecule
Emp. Form.:
C26H26F2N2O4S
Mol. Mass.:
500.557
SMILES:
CCS(=O)(=O)c1ccc(CC(=O)Nc2ccc(c(F)c2)C(C)(C)C(=O)Nc2ccc(F)cc2)cc1
: