Target
Nuclear receptor ROR-gamma
Ligand
BDBM50466377
Substrate
Meas. Tech.
ChEMBL_1792872 (CHEMBL4264791)
IC50
<30±n/a nM
Citation
 Sasaki, YOdan, MYamamoto, SKida, SUeyama, AShimizu, MHaruna, TWatanabe, AOkuno, T Discovery of a potent orally bioavailable retinoic acid receptor-related orphan receptor-gamma-t (ROR?t) inhibitor, S18-000003. Bioorg Med Chem Lett 28:3549-3553 (2018)  
Target
Name:
Nuclear receptor ROR-gamma
Synonyms:
NR1F3 Nuclear receptor ROR-gamma (RORC) RAR-related orphan receptor C (RORc) RORG RZRG Retinoid-related orphan receptor-gamma (RORc)
Type:
Enzyme Catalytic Domain
Mol. Mass.:
58218.40
Organism:
Homo sapiens (Human)
Description:
P51449
Residue:
518
  
Inhibitor
Name:
BDBM50466377
Synonyms:
CHEMBL4279772
Type:
Small organic molecule
Emp. Form.:
C26H25FN4O4S
Mol. Mass.:
508.565
SMILES:
CCS(=O)(=O)c1ccc(CC(=O)Nc2ccc(c(F)c2)C(C)(C)C(=O)Nc2cc(ccn2)C#N)cc1
: