Target
Neuropeptide Y receptor type 5
Ligand
BDBM50466532
Substrate
Meas. Tech.
ChEMBL_1793337 (CHEMBL4265256)
Ki
0.500000±n/a nM
Citation
 Østergaard, SKofoed, JPaulsson, JFMadsen, KGJorgensen, RWulff, BS Design of Y J Med Chem 61:10519-10530 (2018)  
Target
Name:
Neuropeptide Y receptor type 5
Synonyms:
NPY-Y5 NPY5-R NPY5R_HUMAN NPYY5 Neuropeptide Y receptor type 5 ( NPY Y5) | Y5 receptor
Type:
Enzyme
Mol. Mass.:
50746.64
Organism:
Homo sapiens (Human)
Description:
Q15761
Residue:
445
  
Inhibitor
Name:
BDBM50466532
Synonyms:
CHEMBL4281479
Type:
Small organic molecule
Emp. Form.:
C194H294N54O58
Mol. Mass.:
4310.7372
SMILES:
CC[C@H](C)[C@H](NC(=O)[C@@H]1CCCN1C(=O)[C@@H](N)Cc1ccc(O)cc1)C(=O)N[C@@H](CCCCN)C(=O)N1CCC[C@H]1C(=O)N[C@@H](CCC(O)=O)C(=O)N[C@@H](C)C(=O)N1CCC[C@H]1C(=O)NCC(=O)N[C@@H](CCC(O)=O)C(=O)N[C@@H](CC(O)=O)C(=O)N[C@@H](C)C(=O)N[C@@H](CO)C(=O)N1CCC[C@H]1C(=O)N[C@@H](CCC(O)=O)C(=O)N[C@@H](CCC(O)=O)C(=O)N[C@@H](CC(C)C)C(=O)N[C@@H](CC(N)=O)C(=O)N[C@@H](CCCNC(N)=N)C(=O)N[C@@H](Cc1ccc(O)cc1)C(=O)N[C@@H](Cc1ccc(O)cc1)C(=O)N[C@@H](C)C(=O)N[C@@H](CO)C(=O)N[C@@H](CC(C)C)C(=O)N[C@@H](CCCNC(N)=N)C(=O)N[C@@H](Cc1cnc[nH]1)C(=O)N[C@@H](Cc1ccc(O)cc1)C(=O)N[C@@H](CC(C)C)C(=O)N[C@@H](CC(N)=O)C(=O)N[C@@H](CC(C)C)C(=O)N[C@@H](C(C)C)C(=O)N[C@@H]([C@@H](C)O)C(=O)N[C@@H](CCCNC(N)=N)C(=O)N[C@@H](CCC(N)=O)C(=O)N[C@@H](CCCNC(N)=N)C(=O)N[C@@H](Cc1ccc(O)cc1)C(O)=O
: