Target
Chymotrypsinogen B
Ligand
BDBM50025875
Substrate
Meas. Tech.
ChEMBL_216621 (CHEMBL819193)
Ki
320±n/a nM
Citation
 Kinder, DHKatzenellenbogen, JA Acylamino boronic acids and difluoroborane analogues of amino acids: potent inhibitors of chymotrypsin and elastase. J Med Chem 28:1917-25 (1986)  
Target
Name:
Chymotrypsinogen B
Synonyms:
Beta-chymotrypsin CTRB1 Chymotrypsin B chain A Chymotrypsin B chain C Synonyms=CTRB
Type:
PROTEIN
Mol. Mass.:
27713.98
Organism:
Homo sapiens (Human)
Description:
ChEMBL_10909
Residue:
263
  
Inhibitor
Name:
BDBM50025875
Synonyms:
2-Amino-N-[1R-(2-phenyl ethyl)]propanamide boronic acid | CHEMBL56732
Type:
Small organic molecule
Emp. Form.:
C11H17BN2O3
Mol. Mass.:
236.075
SMILES:
CC(N)C(=O)N[C@@H](Cc1ccccc1)B(O)O
: