Target
Chymotrypsinogen B
Ligand
BDBM50025860
Substrate
Meas. Tech.
ChEMBL_216621 (CHEMBL819193)
Ki
650±n/a nM
Citation
 Kinder, DHKatzenellenbogen, JA Acylamino boronic acids and difluoroborane analogues of amino acids: potent inhibitors of chymotrypsin and elastase. J Med Chem 28:1917-25 (1986)  
Target
Name:
Chymotrypsinogen B
Synonyms:
Beta-chymotrypsin CTRB1 Chymotrypsin B chain A Chymotrypsin B chain C Synonyms=CTRB
Type:
PROTEIN
Mol. Mass.:
27713.98
Organism:
Homo sapiens (Human)
Description:
ChEMBL_10909
Residue:
263
  
Inhibitor
Name:
BDBM50025860
Synonyms:
CHEMBL292664 | N-(2-phenyl ethyl)benzamide boronic acid
Type:
Small organic molecule
Emp. Form.:
C15H16BNO3
Mol. Mass.:
269.103
SMILES:
OB(O)C(Cc1ccccc1)NC(=O)c1ccccc1
: