Target
Chymotrypsinogen B
Ligand
BDBM50025861
Substrate
Meas. Tech.
ChEMBL_216621 (CHEMBL819193)
Ki
5000±n/a nM
Citation
 Kinder, DHKatzenellenbogen, JA Acylamino boronic acids and difluoroborane analogues of amino acids: potent inhibitors of chymotrypsin and elastase. J Med Chem 28:1917-25 (1986)  
Target
Name:
Chymotrypsinogen B
Synonyms:
Beta-chymotrypsin CTRB1 Chymotrypsin B chain A Chymotrypsin B chain C Synonyms=CTRB
Type:
PROTEIN
Mol. Mass.:
27713.98
Organism:
Homo sapiens (Human)
Description:
ChEMBL_10909
Residue:
263
  
Inhibitor
Name:
BDBM50025861
Synonyms:
CHEMBL56829 | N-benzylbenzamide difluoroborane
Type:
Small organic molecule
Emp. Form.:
C14H12BF2NO
Mol. Mass.:
259.059
SMILES:
FB(F)C(NC(=O)c1ccccc1)c1ccccc1
: